,Gender,Age,BirthYear,Ht (in),Ht (meters),Weight (lb) Pre,Converted to kg H/2.205),Weight (lb) Post,Converted to kg J/2.205),BMIPre,BMIPost,Body Fat % Pre,Body Fat % Post,Visceral Fat Pre,Visceral Fat Post,Systolic BP Pre,Systolic BP Post,Diastolic BP Pre,Diastolic BP Post,RHR Pre,RHR Post,%BMI,%kg,%Body Fat,%Visceral,%AvgHandGrip,%MaxHandGrip,%ChairStand,%HeelRaise,%AvgQuadStr,%MaxQuadStr,%MaxHip abd,%Hip AB Normalized to BW (N/kg),%8ftUpAv (s),%8ftMin,%ABC,%Phys,%Cognition,%CVLT Total T,%ImmRecal,%ShortDelayResp,%LongDelayFreeRecall,%Attention,%WorkingMem,%CardSorting,%ProcessingSpeed,%SequentialMem,%CognitiveComposite,%6MinWalkDistance,%AvgStrideLength,%StrideMaxLength,%StrideAvgWidth,%StrideMaxWidth,%StrideAvgVel,%StrideMaxVel,%Stride Avg Cadence in steps/min,%Stride Max Cadence in steps/min,%FGAvLength,%FGMaxLengthPost,%FGAvWidthPre,%FGMaxWidthPre,%FGAvVelPre,%FGMaxVelPre,%FGAvCadencePre,%FGAvCadencePre,%FGMaxCadencePre,%DTAvLength,%DTMaxLength,%DTAvWidth,%DTMaxWidth,%DTAvVel,%DTMaxVel,%DTAvCadenc,%DTMaxCadence,%SS_AvVel,%FG_AvVel,%DT_AvVel,Vel_COST_pre,%Cog_COST,%SS_AvStrL,%FG_AvStrL,DT_AvStrL,%SS_AvCad,%FG_AvCad,DT_AvCad,%L_WS,%L_Step,%L_Move,%R_WS,%R_Step,%R_Move,%Comb_WS,%Comb_Step,%Comb_move,%MTS_ML_Dist_Pre,%MTS_ML_Excursion_Pre,%MTS_ML_Vel_Pre,%MTS_ML_Range_Pre,%MTS_AP_Dist_Pre,%MTS_AP_Excursion_Pre,%MTS_AP_Vel_Pre,%MTS_AP_Range_Pre,%NS_ML_Dist,%NS_ML_Excursion,%NS_ML_Vel,%NS_ML_Rang,%NS_AP_Dist,%NS_AP_Excursion,%NS_AP_Vel,%NS_AP_Range,%TS_ML_Dist_Pre,%TS_ML_Excursion_Pre,%TS_ML_Vel_Pre,%TS_ML_Range_Pre,%TS_AP_Dist_Pre,%TS_AP_Excursion_Pre,%TS_AP_Vel_Pre,%TS_AP_Range_Pre,%M-M,%CRP,%IFNy,%IL-10,%IL-1a,IL-1b,%IL-6,%TNF-a
GHA01,1,80,1938,60.5,1.5367,116.6,52.87981859,114.4,51.88208617,22.4,22,33.2,33.1,88.8,86.9,155,168,61,62,90,83,-1.785714286,-1.886792453,-0.301204819,-2.13963964,13.82,11.54,23.1,,47.53218884,28.53403141,,,-1.21,1.06,-3.8,-0.19315,7.027391,-10.2941,-10.9091,-8.33333,0,11.36364,23.4375,76.66667,14.28571,-13.2075,25.5814,14.13181242,0.246553,0.419779,-0.45693,-0.16114,-0.75344,0.273355,-0.97654,-0.24921,0.104907,-0.11182,-0.02647,-7.20305,10.90274,10.61798,11.76377,11.40988,11.40988,4.61584711,5.923432,-3.96928,2.242923,5.730371,6.652077,1.808704,2.994976,-0.75344,10.90274,5.730371,41.89121,-23.8539,0.246553,0.104907,4.615847,-0.97654,11.76377,1.808704,,,,,,,,,,96.86059,-4.84069,-4.84069,64.99268,38.34897,1.191968,1.191968,18.44156,47.20979,-8.36888,-8.36888,70.11079,1.104243,-21.9378,-21.9378,-6.41913,35.14857,20.74381,20.74381,32.85113,36.7647,26.62406,26.62406,7.384816,97.94721,273.65,19.35767708,15.28231,86.26292,25.97899,235.8974,14.35407
GHA03,2,68,1949,66.3,1.68402,189.3,85.85034014,189.9,86.12244898,30.3,30.4,25,27.3,101.4,109.2,148,150,74,89,79,69,0.330033003,0.316957211,9.2,7.692307692,12.89,13.07,0,0,18.7114462,12.77777778,1.855583,1.533764,-19.38,-20.11,1.63,1.509107,-4.62621,41.66667,43.58974,12.5,0,-29.6296,18.18182,20,14.7541,0,4,20.77515916,0.864106,2.84461,10.41865,13.6089,-1.78356,-1.31472,-3.54751,-2.84073,-0.01185,0.179697,-11.419,-8.12228,2.034997,1.810301,1.903428,3.225926,3.225926,2.602914323,0.373239,-17.7895,-21.9348,7.003884,5.924767,4.550307,6.115859,-1.78356,2.034997,7.003884,-35.3208,-14.2143,0.864106,-0.01185,2.602914,-3.54751,1.903428,4.550307,-1.04658,-9.35118,-4.81101,14.34641,-11.3598,4.095565,7.051098,-10.2959,-0.33707,-19.4147,-14.1521,-14.1521,-4.65843,4.59311,-8.12447,-8.12447,-3.03892,12.72246,-15.1112,-15.1112,8.248357,9.116493,5.137171,5.137171,12.73343,-29.1423,-40.2569,-40.2569,-27.2974,-28.1669,-28.7661,-28.7661,-33.6646,97.46403,,15.87301587,7.207207,6.829817,,2.933541,20.05513
GHA07,1,71,1947,65.9,1.67386,195.6,88.70748299,192.3,87.21088435,31.7,31.1,43.8,44.7,209.1,213.6,114,117,60,64,60,53,-1.892744479,-1.687116564,2.054794521,2.152080344,34.62,19.4,18.2,25,1.3006886,-0.219298246,-8.46516,-6.89436,-17.61,-16.99,-1.21,-1.24535,3.366713,3.333333,3.773585,0,22.22222,16.32653,10,22.41379,-12.3077,0,8.928571,9.228289341,-3.74207,-3.81384,-13.7663,-7.27958,-11.317,-10.5343,-8.02273,-7.17095,4.937341,5.369735,-9.92488,-9.74833,18.33644,23.16732,15.50073,23.72228,23.72228,8.630387077,14.82878,-18.2263,-13.5785,41.02452,56.10145,29.50612,35.47551,-11.317,18.33644,41.02452,-43.8996,-5.50979,-3.74207,4.937341,8.630387,-8.02273,15.50073,29.50612,21.37008,28.66613,24.55548,17.12856,31.49678,23.09636,19.11272,30.11124,23.79239,-2.49008,-2.12195,-2.12195,22.09374,3.27949,-18.2171,-18.2171,5.587229,21.57796,10.16577,10.16577,-9.04723,18.87128,17.64325,17.64325,23.19744,21.92557,8.450139,8.450139,9.109018,67.07976,4.151172,4.151172,-25.5922,16.00646,,,,,,,
GHA13,1,65,1953,59.1,1.50114,132.9,60.27210884,130,58.9569161,26.8,26.2,47.2,45.7,176.6,166.3,121,124,76,71,89,78,-2.23880597,-2.182091798,-3.177966102,-5.832389581,17.44,10.55,17.6,11.11111111,-16.37298091,-12.89640592,17.30203,19.91877,-15.77,-17.38,1.44,11.40567,-4.57026,10.9375,11.66667,-6.66667,36.36364,10.25641,15.15152,9.52381,52.63158,15.55556,29.54545,6.660721253,2.692683,4.389116,3.229734,6.783626,5.585514,4.316601,2.403175,2.998092,4.888717,0.5151,-12.9668,-10.6763,-0.29916,1.189127,-4.58764,-10.4058,-10.4058,-2.360683607,-4.96573,-3.67678,-5.72516,0.743681,-3.52611,3.094967,1.425178,5.585514,-0.29916,0.743681,-54.1158,17.18243,2.692683,4.888717,-2.36068,2.403175,-4.58764,3.094967,-17.6286,-27.1318,-22.88,11.08867,-20.4109,-6.41334,-3.65884,-23.8417,-14.8416,-19.5237,17.59718,17.59718,-10.9019,-4.91297,1.678296,55.78185,1.918911,-16.3345,-5.41515,-5.41515,-4.22646,-31.0486,-5.83002,-5.83002,-23.3228,-21.1737,-0.82862,-0.82862,-24.5157,-17.5473,-11.1976,-11.1976,-12.2977,28.65652,-3289.62,-31.59379408,-7.45672,-7.57884,,-20.685,-21.2448
GHA15,2,66,1952,68.9,1.75006,212.4,96.32653061,216.3,98.0952381,31.5,32,27.1,28.1,117.8,122.9,127,141,88,81,81,85,1.587301587,1.836158192,3.6900369,4.329371817,5.49,8.23,4.3,15.38461538,-0.762016413,-3.29153605,-2.88138,-4.63248,-5.79,-4.19,-1.27,-1.54351,13.78468,17.74194,22,0,9.090909,-14,-14,0,34.28571,6.896552,3.921569,7.498015443,4.399929,7.262655,5.374359,5.882723,2.294696,1.357559,-3.90072,-7.88957,3.436027,3.331655,-1.64608,5.667141,20.92083,21.71405,16.64588,19.5578,19.5578,6.260907748,4.211841,-0.45518,-3.31201,30.3958,26.35706,23.8335,25.63196,2.294696,20.92083,30.3958,-68.8723,486.6806,4.399929,3.436027,6.260908,-3.90072,16.64588,23.8335,-15.571,-24.3342,-20.0809,-5.92839,-29.0567,-18.3536,-10.9824,-26.6884,-19.2384,19.78872,-4.51663,-4.51663,7.006256,13.98804,2.321999,2.321999,6.837484,-4.14947,-1.32544,-1.32544,-14.9994,19.44467,0.030237,0.030237,7.312867,-34.2794,-9.33998,-9.33998,-20.5709,3.459047,-20.4095,-20.4095,-29.7275,-5.38748,-2822.3,-59.71760797,-34.1873,10.12859,,4.586706,-58.8054
GHA16,1,67,1951,64.3,1.63322,196.7,89.20634921,201.2,91.24716553,33.5,34.2,44.2,45.5,190.9,209.3,138,139,69,70,68,67,2.089552239,2.287747839,2.941176471,9.638554217,-12.77,-6.25,46.2,50,20.93385214,24.10901468,15.01039,12.43809,-8.06,-10.1,14.81,-6.0843,9.80714,35,38.88889,85.71429,116.6667,23.91304,16.27907,0,0,21.95122,20.93023,-1.332593004,-4.72808,-3.14634,-3.42578,1.527273,-9.5476,-10.0882,-5.57614,-8.88847,3.07435,2.255245,-11.1185,-2.31428,4.588709,0.636402,-0.66896,-2.16161,-2.16161,7.203205611,4.701713,-0.89992,-3.90035,12.8391,13.80626,4.59576,5.29244,-9.5476,4.588709,12.8391,-52.5149,977.8221,-4.72808,3.07435,7.203206,-5.57614,-0.66896,4.59576,25.16328,8.235041,16.36089,17.39236,2.950009,10.43904,20.85067,5.504603,13.1878,-12.4379,-3.0009,-3.0009,-20.1428,-21.9508,-9.71523,-9.71523,-18.6324,35.10582,28.66522,28.66522,30.15059,-18.0191,21.02644,21.02644,6.780325,-8.84338,-5.08379,-5.08379,-14.869,-16.7811,-34.7878,-34.7878,-44.036,-9.18893,15015.34,13.63115693,50.83056,,28.125,,10.33263
GHA21,2,80,1938,66.8,1.69672,187,84.80725624,188.5,85.48752834,29.5,29.7,,,,,157,129,66,89,64,70,0.677966102,0.802139037,,,0.86,0,75,0,5.007256894,7.453416149,15.09185,14.176,-13.65,-14.23,0.63,2.500913,4.798599,-4.6875,-4.87805,-22.2222,-20,0,0,-8.33333,-8.33333,-11.5385,1.612903,10.33346922,11.19032,13.18609,5.943324,11.0259,22.12392,26.52161,10.61149,8.987555,3.74438,3.739219,2.748861,8.766196,13.10241,12.80686,9.148774,9.030676,9.030676,-0.05477176,-1.00773,3.504122,0.24321,4.355519,2.600673,-3.74243,-16.1391,22.12392,13.10241,4.355519,39.98012,323.7346,11.19032,3.74438,-0.05477,10.61149,9.148774,-3.74243,19.35278,-27.2791,-5.28591,-16.5627,-31.6138,-24.1786,-0.25567,-29.5491,-15.3832,16.34343,11.26007,11.26007,6.762566,8.16013,28.31388,28.31388,41.76245,35.44566,33.32927,33.32927,31.64626,-26.9378,34.17239,34.17239,-17.1228,10.87807,14.52135,14.52135,16.1273,-19.6435,18.59035,18.59035,-15.5693,-16.1342,,,,,,,
GHA20,1,78,1940,63.8,1.62052,103.1,46.75736961,105.6,47.89115646,17.8,18.2,19.2,22.2,46.6,55,122,141,62,63,68,57,2.247191011,2.424830262,15.625,18.02575107,1.27,3.7,9.5,0,-18.61281826,-13.29923274,11.54632,8.905549,-7.36,-7.74,0.63,1.009856,-20.0408,3.17,3.571429,-21.4286,-8.33333,7.352941,0,0,-21.9178,-18.8406,-9.21053,-4.147713993,-0.62209,0.12407,43.41203,-0.21335,-2.10549,-5.55291,1.132466,-3.356,27.01323,26.7336,334.0202,325.2435,-5.61204,-6.1862,-23.8308,-25.6567,-25.6567,-4.005869607,4.946426,-44.804,-19.1609,15.20929,14.26016,19.3269,21.605,-2.10549,-5.61204,15.20929,-194.585,87.00783,-0.62209,27.01323,-4.00587,1.132466,-23.8308,19.3269,-21.8832,6.16334,-9.11475,7.015806,9.589415,8.048018,-6.88083,7.752417,-0.61173,9.170269,-4.11845,-4.11845,14.06989,19.71872,6.087363,6.087363,46.20195,9.936161,-14.342,-14.342,-19.209,-18.3064,-9.50543,-9.50543,-28.7573,-8.82311,-15.2703,-15.2703,13.30476,-18.8195,-15.3778,-15.3778,-5.86559,-20.4685,-8311.41,67.63110307,102.1531,,,,20.33462
GHA22,1,67,1951,63.5,1.6129,140.1,63.53741497,134.8,61.13378685,24.4,23.5,36.4,31.3,117.5,86.6,129,118,68,62,73,66,-3.68852459,-3.783012134,-14.01098901,-26.29787234,-17.07,-25,11.8,8.333333333,8.839190628,9.748427673,8.165095,12.41788,-1.07,1.09,1.17,8.868125,-0.29809,18.75,18.33333,23.07692,0,0,-19.2308,20,15.78947,9.615385,7.692308,0.608644656,-1.6828,-2.53,-9.55479,-10.0611,-4.77483,-8.64964,-5.1154,-11.5042,3.774028,2.337437,-11.5489,-11.2828,-8.29513,1.446084,1.529059,3.368463,3.368463,10.98610902,10.44794,-14.2899,-12.719,6.163122,4.734092,-5.08784,-4.11394,-4.77483,-8.29513,6.163122,-132.801,-84.6867,-1.6828,3.774028,10.98611,-5.1154,1.529059,-5.08784,-29.9526,-6.4462,-20.7937,-29.0681,-4.99045,-18.5697,-29.5508,-5.71535,-19.7397,-14.3612,-7.31912,-7.31912,-9.06348,31.97552,-4.48119,-4.48119,2.989939,-13.5958,14.66046,14.66046,-22.1166,-4.73959,31.96994,31.96994,-5.08429,4.251849,-4.15573,-4.15573,5.826294,-19.0323,-6.37971,-6.37971,-0.91813,-5.15651,-5952.06,-35.16483516,-35.8233,,,,-29.1845
GHA28,2,72,1946,69.8,1.77292,204.3,92.65306122,202.2,91.70068027,29.5,29.2,28.5,25.3,121.8,111.4,104,119,59,76,60,59,-1.016949153,-1.027900147,-11.22807018,-8.538587849,-6.25,-2.63,6.7,14.28571429,-22.46949031,-17.23446894,20.35176,21.6017,-20.22,-20,8,5.89599,29.1563,8.57,10.71429,-7.14286,7.142857,30,12.69841,7.142857,26.53061,7.142857,22.22222,2.989943833,-5.28076,-6.33263,-4.74366,-15.1887,-10.9527,-11.1051,-6.3763,-6.19273,12.88989,14.26932,37.1786,22.18153,-3.57059,14.02827,7.181346,6.436806,6.436806,2.772462111,1.34937,0.025023,-10.8678,0.884611,-6.30326,-2.29197,-10.1926,-10.9527,-3.57059,0.884611,-19.8268,190.5873,-5.28076,12.88989,2.772462,-6.3763,7.181346,-2.29197,2.02614,-8.43689,-2.91951,2.118652,16.47718,8.594912,2.075264,4.251104,3.079208,-25.0836,-32.2459,-32.2459,-24.1797,-31.0148,-15.9832,-15.9832,-28.5206,-23.1398,-12.2449,-12.2449,-24.9752,-23.4065,-13.0426,-13.0426,-27.2654,-25.6856,-9.3916,-9.3916,-21.2167,-33.2855,-17.3054,-17.3054,-55.5632,60.48078,-8579.16,-52.43055556,-44.4619,,,,-26.6947
GHA33,2,60,1958,65.5,1.6637,203.6,92.33560091,194.8,88.3446712,33.4,31.9,40.7,38.9,190.9,176.7,153,137,89,82,72,74,-4.491017964,-4.322200393,-4.422604423,-7.43844945,17.86,14.29,36.4,20,-8.716707022,-9.367681499,-0.06217,4.452478,-9.58,-7.718696,-6.05,-12.8894,-0.72919,-1.56,-1.92308,-10,-7.14286,11.42857,14.89362,0,9.756098,11.62791,17.64706,-12.0185163,12.50891,13.40209,-11.8048,-22.5397,14.93367,15.2061,1.15298,1.322797,10.43718,12.15421,-1.35667,13.65024,10.96519,15.59232,-1.7031,-4.03397,-4.03397,1.23225376,-2.03618,16.54323,8.410007,-2.41683,-4.91453,-5.12242,-7.99507,14.93367,10.96519,-2.41683,-693.163,-2.86511,12.50891,10.43718,1.232254,1.15298,-1.7031,-5.12242,21.26954,-9.18777,7.524927,19.73796,6.790123,14.07166,20.51915,-1.58004,10.69228,-0.77111,3.20719,3.20719,-3.90679,-3.96138,-18.3771,-18.3771,-19.0071,-2.56532,-7.9007,-7.9007,-12.0767,-14.7477,-4.48851,-4.48851,0.328806,-4.94821,13.69876,13.69876,0.887295,-4.86327,0.938159,0.938159,13.44262,-30.1641,-8955.5,-31.43133462,22.89348,3.944206,,-5.4917,-1.78427
GHA29,2,68,1950,69.4,1.76276,162.7,73.78684807,158.7,71.97278912,23.7,23.2,20,18.7,68.9,63.3,123,111,65,57,73,69,-2.109704641,-2.4585126,-6.5,-8.127721335,5.15,3.7,5.9,0,-13.09855587,-7.228915663,3.452228,6.059719,-17.46,-16.89189,-0.01,0,0,3.13,3.846154,-30,-10,-6.66667,-5.26316,1.886792,20,0,2.083333,-3.159983464,0.169567,-2.35876,-22.051,-22.1362,-0.1083,-1.93534,-0.32545,-7.17875,-7.28953,-8.02688,-19.3878,-26.2217,19.45867,16.29619,29.12775,28.97013,28.97013,-1.325081373,-0.99367,-5.56953,-2.27994,10.4632,13.27305,12.3058,13.91938,-0.1083,19.45867,10.4632,-239.837,-42.1444,0.169567,-7.28953,-1.32508,-0.32545,29.12775,12.3058,-27.3538,-9.59122,-19.2425,-0.52297,6.163643,2.535106,-14.8885,-2.26076,-9.11798,-12.0004,-5.39479,-5.39479,-4.49457,-12.582,2.218055,2.218055,-7.68167,24.84105,30.14847,30.14847,33.77577,10.98545,8.436173,8.436173,3.810775,-9.33866,-27.5261,-27.5261,-15.4202,-2.95321,-23.3752,-23.3752,-5.79495,1981.25,149120.07,-21.12467629,46.17834,,71.10553,,29.84997
GHA30,1,66,1952,65.4,1.66116,166.1,75.32879819,162.7,73.78684807,27.3,26.7,39.5,39.5,154.2,154.2,126,134,85,86,85,80,-2.197802198,-2.046959663,0,0,8.75,10.71,7.1,0,-5.299739357,-10.48387097,0.151533,2.244435,-10.26,-7.08502,-0.63,11.48325,-0.15296,23.08,25,12.5,33.33333,0,5.357143,10.41667,-7.46269,-9.09091,0,9.72394755,7.976093,11.81404,2.282808,0.436413,10.94382,10.98945,0.5262,-3.53397,-3.06443,1.290237,-32.1906,-7.03418,-0.56246,-1.38611,3.101006,13.58418,13.58418,-1.355004842,-0.54352,17.24108,12.74574,0.571916,0.280218,2.663537,10.23009,10.94382,-0.56246,0.571916,-8.20247,-1.30462,7.976093,-3.06443,-1.355,0.5262,3.101006,2.663537,-13.883,-12.0885,-13.0168,-28.2853,3.736034,-15.1525,-21.5556,-4.8203,-14.0845,10.64423,21.09904,21.09904,6.88157,4.616551,2.798214,2.798214,2.427638,37.72614,12.71456,12.71456,25.40559,10.74416,26.19959,26.19959,11.17922,0.418131,8.462834,8.462834,-0.89715,-11.5436,-34.1836,-34.1836,-25.4056,734.3182,-7718.99,7.142857143,5.485018,-43.0078,-4.48276,-34.0541,-26.2053
GHA31,2,65,1953,70,1.778,234.7,106.4399093,226.6,102.7664399,32.8,31.7,33.9,33.4,181,168.7,159,148,87,79,75,75,-3.353658537,-3.451214316,-1.474926254,-6.79558011,23.14,35.13513514,,0,-23.00503235,-25.2293578,5.862305,9.646438,2.85,-0.931677,5.36,14.26765,0.375299,34.04,34.21053,75,50,7.5,0,0,-14.2857,-33.9623,-14.8936,-3.254930312,-3.59799,-2.74546,-13.5972,-10.6197,-1.88058,1.793144,1.851232,2.800236,7.702012,9.940287,-10.5279,5.492806,18.83636,22.73902,8.487421,5.82612,5.82612,-0.44864746,-0.70039,-12.7551,-13.6072,2.927871,5.354774,1.536921,0.979151,-1.88058,18.83636,2.927871,396.5532,89.39706,-3.59799,7.702012,-0.44865,1.851232,8.487421,1.536921,-25.0108,8.39555,-10.6495,-19.4756,-10.5841,-15.3793,-22.1908,-1.86427,-13.1248,-13.4075,-12.5929,-12.5929,-2.13641,-5.28548,-18.2748,-18.2748,-4.9389,-2.49968,2.058582,2.058582,4.388038,1.22165,-23.6221,-23.6221,6.276436,38.94135,2.655695,2.655695,32.23038,-21.7234,5.790134,5.790134,5.273053,312.9815,4378.78,-47.80023781,-36.2254,-81.1858,,,-38.3256