Participant,Gender,Age,Ht (m),Weight (kg; H/2.205) Pre,Weight Change (Kg),BMIPre,BMI Change,Body Fat % Pre,Body-fat-% Change,Visceral Fat Pre,Visceral Fat Change,Systolic BP Pre,Systolic BP Change (mmHg),Diastolic BP Pre,Diastolic BP Change (mmHg),RHR Pre,RHR Change (BPM),HandGripAvPre,HandGripAv Change,HandGripMaxPre,HandGripMax Change,ChairStandPre,ChairStand Change,HeelRaisePre,HeelRaise Change,QuadStrengthAvgPre,QuadStrengthAv Change,QuadMaxPre,QuadStrengthMax Change,MaxHip abd Pre (N),MaxHip Abd Change,Pre Hip,MaxHip Change,8ftUpAvPre,8ftUpAv Change,8ftUpMinPre (s),8ftUpMin Change,SF12 PrePhys,SF12 Phys Change,SF12 PreCog,SF12 Cog Change,CLVT TotalTPre,CVLT Total Change,CLVT IR Pre,CLVT IR Change,CLVT SD Pre Free,CLVT SD Change,CLVT LD Pre Free,CLVT LD Change,NIH AttnPre,NIH Attn Change,NIH WrkMemryPre,NIH WrkMem Change,NIH CardSrtPre,NIH CardSrt Change,NIH PrcssSpdPre,NIH ProcSpd Change,NIH SeqMemryPre,NIH SeqMem Change,NIH CogCompstePre,NIH CogComp Change,6MinWalkDistancePreMts,6MinWalkDistance Change (m),SSAvLengthPre,SSAvLength Change,SSAvWidthPre,SSAvWidth Change,SSAvVelPre,SSAvVel Change,SSAvCadencePre,SSAvCadence Change,FGAvLengthPre,FGAvLength Change,FGAvWidthPre,FGAvWidth Change,FGAvVelPre,FGAvVel Change,FGMaxVelPre,FGMaxVel Change,FGAvCadencePre,FGAvCadence Change,DTAvLengthPre,DTAvLength Change,DTAvWidthPre,DTAvWidth Change,DTAvVelPre,DTAvVel Change,DTMaxVelPre,DTMaxVel Change,DTAvCadencePre,DTAvCadence Change,Vel_COST_Pre,Vel Cost Change,Cog_COST_Pre,Cog Cost Change,L_WS_Pre,L_WS Change,L_Step_Pre,L_Step Change,L_Move_Pre,L_Move Change,R_WS_Pre,R_WS Change,R_Step_Pre,R_Step Change,R_Move_Pre,R_Move Change,Comb_WS_Pre,Comb_WS Change,Comb_Step_Pre,Comb_Step Change,Comb_Move_Pre,Comb_Move Change,MTS_ML_Dist_Pre,MTS_ML_Dist Change,MTS_ML_Excursion_Pre,MTS_ML_Excursion Change,MTS_ML_Vel_Pre,MTS_ML_Vel Change,MTS_ML_Range_Pre,MTS_ML_Range Change,MTS_AP_Dist_Pre,MTS_AP_Dist Change,MTS_AP_Excursion_Pre,MTS_AP_Excursion Change,MTS_AP_Vel_Pre,MTS_AP_Vel Change,MTS_AP_Range_Pre,MTS_AP_Range Change,NS_ML_Dist_Pre,NS_ML_Dist Change,NS_ML_Excursion_Pre,NS_ML_Excursion Change,NS_ML_Vel_Pre,NS_ML_Vel Change,NS_ML_Range_Pre,NS_ML_Range Change,NS_AP_Dist_Pre,NS_AP_Dist Change,NS_AP_Excursion_Pre,NS_AP_Excursion Change,NS_AP_Vel_Pre,NS_AP_Vel Change,NS_AP_Range_Pre,NS_AP_Range_Post,TS_ML_Dist_Pre,TS_ML_Dist Change,TS_ML_Excursion_Pre,TS_ML_Excursion Change,TS_ML_Vel Change,TS_ML_Range_Pre,TS_ML_Range Change,TS_AP_Dist Change,TS_AP_Excursion_Pre,TS_AP_Excursion Change,TS_AP_Vel_Pre,TS_AP_Vel  Change,TS_AP_Range_Pre,TS_AP_Range Change,ABC%Pre,ABC% Change,RPAQ M-M Pre,RPAQ M-M Change,CRP Pre,CRP Change,IFNy Pre,IFNy Change,IL-10 Pre,IL-10 Change,IL-1a Pre,IL-1a Change,IL-1b Pre,IL-1b Change,IL-6 Pre,IL-6 Change,TNF-a Pre,TNF-a Change,Time1 (min),Distance1 (mi),Strd Length 1 (cm),TotalSteps1,Time2 (s),Distance2 (mi),Strd Length 2 (cm),TotalSteps2,R1 Swings,R1 Bendovers,R1 Putts,R2 Swings,R2 Bendovers,R2 Putts
1,1,80,1.5367,52.87981859,-0.997732426,22.4,-0.4,33.2,-0.1,88.8,-1.9,155,13,61,1,90,-7,24.6,3.4,26,3,13,3,,,31.06666667,14.76666667,38.2,10.9,,,,,4.95,-0.06,4.72,0.05,56.95,-0.11,44.54,3.13,68,-7,55,-6,12,-1,11,0,44,5,64,15,30,23,35,5,53,-7,43,11,520.74,73.59,149.934,0.369666667,9.775333333,-0.044666667,156.8366667,-1.181666667,125.375,-1.224333333,160.4603333,0.168333333,8.816,-0.002333333,188.714,20.575,196.205,20.833,143.2306667,16.84933333,153.0163333,7.063,10.32933333,-0.41,169.8086667,9.730666667,174.096,11.581,133.5763333,2.416,0.100179814,-0.041966533,-0.930269109,-0.221905614,,,,,,,,,,,,,,,,,,,0.002865856,0.002775885,0.1789,-0.00866,0.008945,-0.000433,0.01593,0.010353333,0.002529213,0.000969927,0.17562,0.002093333,0.008781,0.000104667,0.0154,0.00284,0.002573463,0.001214927,0.174635,-0.014615,0.00873175,-0.00073075,0.01384,0.009703333,0.002952917,3.26E-05,0.13596,-0.029826667,0.006798,-0.001491333,0.01589,-0.00102,0.006369414,0.002238758,0.435326667,0.090303333,0.004515167,0.036406667,0.01196,0.001613376,0.340556667,0.09067,0.017027833,0.0045335,0.030603333,0.00226,98.75,-3.75,1023,1002,1.6627,0.0455,22.73,4.4,39.85,6.09,33.85,29.2,10.47,2.72,1.56,3.68,27.17,3.9,92,1.3,150.85,2774,,,,,40,35,27,,,
3,2,68,1.68402,85.85034014,0.272108844,30.3,0.1,25,2.3,101.4,7.8,148,2,74,15,79,-10,45.76666667,5.9,45.9,6,20,0,16,0,48.63333333,9.1,54,6.9,271.274388,5.033721,3.159852222,0.048464684,5.47,-1.06,5.32,-1.07,57.65,0.87,56.85,-2.63,48,20,39,17,8,1,12,0,54,-16,44,8,45,9,61,9,46,0,50,2,626.71,130.2,150.2516667,1.298333333,11.92733333,1.242666667,141.178,-2.518,114.2116667,-4.051666667,177.2233333,-0.021,12.24566667,-1.398333333,197.6743333,4.022666667,202.342,3.663,133.496,2.541,172.8703333,4.499666667,14.64533333,-2.605333333,173.7226667,12.16733333,189.172,11.208,119.904,5.456,0.121167307,0.042797277,-0.804122249,-0.114300335,0.328533333,-0.003438361,0.2724,-0.025472626,0.600933333,-0.028910987,0.364666667,0.052316574,0.241866667,-0.027475605,0.606533333,0.024840968,0.6932,0.048878212,0.514266667,-0.052948231,1.207466667,-0.004070019,0.004360071,-0.000846496,0.366046667,-0.051803333,0.018302333,-0.002590167,0.02347,-0.001093333,0.004432517,0.00020359,0.325313333,-0.02643,0.016265667,-0.0013215,0.025776667,-0.000783333,0.004243087,0.000539825,0.38755,-0.058563333,0.0193775,-0.002928167,0.02942,0.002426667,0.005658134,0.000515823,0.278363333,0.0143,0.013918167,0.000715,0.02856,0.003636667,0.006983414,-0.002035127,0.86949,-0.35003,-0.0175015,0.04429,-0.01209,-0.001401982,0.66721,-0.19193,0.0333605,-0.0095965,0.037235,-0.012535,95.63,1.56,3144.75,3065,0,2.1815,8.19,1.3,18.87,1.36,613.34,41.89,0,,77.04,2.26,14.51,2.91,92,1.74,151.55,3695,92,1.76,151.55,3738,64,33,29,,,
7,1,71,1.67386,88.70748299,-1.496598639,31.7,-0.6,43.8,0.9,209.1,4.5,114,3,60,4,60,-7,17.33333333,6,20.1,3.9,11,2,12,3,43.56666667,0.566666667,45.6,-0.1,159.156459,-13.472844,1.794171739,-0.12369659,5.765,-1.015,5.65,-0.96,53.8,-0.67,57.92,1.95,60,2,53,2,8,0,9,2,49,8,50,5,58,13,65,-8,51,0,56,5,545.93,50.38,129.6073333,-4.85,9.562,-1.316333333,145.251,-16.438,134.3516667,-10.77866667,138.9006667,6.858,9.185666667,-0.911666667,192.571,35.31066667,196.052,45.42,165.889,25.714,126.5296667,10.92,8.659666667,-1.578333333,134.0336667,54.98666667,136.615,76.643,126.82,37.41966667,0.303977927,0.133444975,-0.985452146,-0.054296317,0.424133333,0.090637616,0.328666667,0.094216015,0.7528,0.184853631,0.482533333,0.082651024,0.3428,0.10797095,0.825333333,0.190621974,0.906666667,0.173288641,0.671466667,0.202186965,1.578133333,0.375475605,0.002821081,-7.02E-05,0.21851,-0.004636667,0.0109255,-0.000231833,0.016143333,0.003566667,0.002513012,8.24E-05,0.260066667,-0.047376667,0.013003333,-0.002368833,0.01754,0.00098,0.003105697,0.000670146,0.22179,0.022546667,0.0110895,0.001127333,0.02428,-0.002196667,0.003590635,0.000677599,0.21623,0.03815,0.0108115,0.0019075,0.021913333,0.005083333,0.004620707,0.001013116,0.506776667,0.042823333,0.002141167,0.036813333,0.003353333,0.00317137,0.456256667,0.01894,0.022812833,0.000947,0.059666667,-0.01527,98.69,-1.19,2631.75,421.25,,,,,,,,,,,,,,,91,1.34,126.56,3408,88,1.25,126.56,3179,39,28,24,,,
13,1,65,1.50114,60.27210884,-1.315192744,26.8,-0.6,47.2,-1.5,176.6,-10.3,121,3,76,-5,89,-11,19.3,3.366666667,19.9,2.1,17,3,9,1,45.4,-7.433333333,47.3,-6.1,139.46625,24.130491,2.313943426,0.460908989,5.58,-0.88,5.35,-0.93,48.66,5.55,58.64,-2.68,64,7,60,7,15,-1,11,4,39,4,66,10,42,4,38,20,45,7,44,13,538.23,35.85,135.404,3.646,10.95033333,0.353666667,141.121,7.882333333,127.179,3.056333333,143.1186667,6.996666667,12.46,-1.615666667,186.4086667,-0.557666667,187.028,2.224,156.304,-7.170666667,155.294,-3.666,12.83733333,-0.472,182.874,1.36,191.089,-6.738,142.1016667,4.398,0.018961922,0.010261404,-0.510629508,0.087738561,0.3868,-0.068187283,0.477733333,-0.129617726,0.864533333,-0.19780501,0.3664,0.040628902,0.458133333,-0.093509056,0.824533333,-0.052880154,0.7532,-0.027558382,0.935866667,-0.223126782,1.689066667,-0.250685164,0.003166586,-0.000618235,0.261026667,0.045933333,0.013051333,0.002296667,0.02018,-0.0022,0.003471892,-0.000170573,0.320563333,0.00538,0.016028167,0.008940808,0.02154,0.000413333,0.00420071,-0.000686163,0.348713333,-0.018883333,0.017435667,-0.000944167,0.025316667,-0.00107,0.004870815,-0.001512321,0.29714,-0.017323333,0.014857,-0.000866167,0.026383333,-0.006153333,0.005876667,-0.001244306,0.589535,-0.004885,-0.00024425,0.03682,-0.009026667,-0.000874866,0.637025,-0.071331667,0.03185125,-0.003566583,0.032025,-0.003938333,86.88,1.25,1133.25,324.75,4.3312,-1.4248,7.09,-2.24,15.02,-1.12,368.79,-27.95,0,,318.83,-65.95,12.05,-2.56,,,,,90,1.46,139.38,3372,,,,37,25,28
15,2,66,1.75006,96.32653061,1.768707483,31.5,0.5,27.1,1,117.8,5.1,127,14,88,-7,81,4,45.5,2.5,46.2,3.8,23,1,13,2,56.86666667,-0.433333333,63.8,-2.1,339.126942,-9.771531,3.520597491,-0.163090874,4.405,-0.255,4.3,-0.18,51.83,-0.8,45.05,6.21,62,11,50,11,12,0,11,1,50,-7,50,-7,62,0,35,12,58,4,51,2,692.85,51.95,144.2523333,6.347,14.625,0.786,136.2126667,3.125666667,116.03,-4.526,186.2713333,6.400333333,17.75933333,-0.292333333,204.106,42.70066667,208.547,45.284,131.466,21.88366667,179.154,11.21666667,15.01233333,-0.068333333,183.2566667,55.70233333,189.399,49.92,122.5963333,29.219,0.102149537,0.070352719,-0.547936496,2.666700505,0.377866667,-0.058837765,0.400666667,-0.097499037,0.778533333,-0.156336802,0.343066667,-0.020338343,0.398266667,-0.115723314,0.741333333,-0.136061657,0.720933333,-0.079176108,0.798933333,-0.213222351,1.519866667,-0.292398459,0.003220748,0.000637345,0.25181,-0.011373333,0.0125905,-0.000568667,0.01865,0.001306667,0.004044979,0.000565813,0.257536667,0.00598,0.012876833,0.000299,0.023156667,0.001583333,0.004450951,-0.000184691,0.32945,-0.004366667,0.0164725,-0.000218333,0.029623333,-0.004443333,0.004755118,0.000924617,0.264573333,8.00E-05,0.013228667,4.00E-06,0.02899,0.00212,0.009159478,-0.003139813,0.863225,-0.080625,-0.00403125,0.04764,-0.0098,0.00019979,0.610915,-0.124685,0.03054575,-0.00623425,0.05371,-0.015966667,98.75,-1.25,1508.125,-81.25,3.596,-1.0149,12.04,-7.19,46.45,-15.88,668.8,67.74,4.43,,122.31,5.61,16.24,-9.55,80,1.49,149.57,3206,89,1.25,149.57,2690,32,28,28,44,30,25
16,1,67,1.63322,89.20634921,2.040816327,33.5,0.7,44.2,1.3,190.9,18.4,138,1,69,1,68,-1,31.33333333,-4,32,-2,13,6,10,5,42.83333333,8.966666667,47.7,11.5,229.476555,34.445334,2.572424015,0.319960504,5.955,-0.48,5.94,-0.6,52.43,-3.19,48.74,4.78,40,14,36,14,7,6,6,7,46,11,43,7,51,0,48,0,41,9,43,9,594.33,-7.92,137.2016667,-6.487,10.781,-0.369333333,138.74,-13.24633333,121.9123333,-6.798,146.3073333,4.498,10.586,-1.177,172.4813333,7.914666667,182.432,1.161,144.6533333,-0.967666667,138.008,9.941,11.37133333,-0.102333333,149.956,19.253,154.43,21.321,132.071,6.069666667,0.130595775,0.068582204,-0.186483147,1.823473348,0.291466667,0.073342582,0.315733333,0.026000771,0.6072,0.099343353,0.363466667,0.063215414,0.337466667,0.009955299,0.700933333,0.073170713,0.654933333,0.136557996,0.6532,0.035956069,1.308133333,0.172514066,0.002731331,-0.000339719,0.17106,-0.005133333,0.008553,-0.000256667,0.01774,-0.003573333,0.003265541,-0.000716813,0.201916667,-0.019616667,0.010095833,-0.000980833,0.018426667,-0.003433333,0.003346697,0.001174885,0.158403333,0.045406667,0.007920167,0.002270333,0.020143333,0.006073333,0.003577312,-0.000644598,0.117883333,0.024786667,0.005894167,0.001239333,0.01701,0.001153333,0.006527946,-0.000577291,0.955095,-0.048555,-0.00242775,0.03588,-0.005335,-0.000922358,0.784485,-0.272905,0.03922425,-0.01364525,0.04393,-0.019345,84.38,12.5,4729.875,-434.625,0.1956,0.2937,8.73,1.19,9.03,4.59,0,,3.2,0.9,0,,14.13,1.46,81,1.68,133.01,4065,90,1.27,133.01,3073,43,25,32,24,29,31
21,2,80,1.69672,84.80725624,0.680272109,29.5,0.2,,,,,157,-28,66,23,64,6,38.66666667,0.333333333,40,0,16,12,16,0,45.93333333,2.3,48.3,3.6,194.884074,29.411613,2.297964616,0.325759468,5.42,-0.74,5.41,-0.77,54.78,1.37,57.1,2.74,64,-3,41,-2,9,-2,10,-2,55,0,55,0,48,-4,48,-4,78,-9,62,1,613.25,63.37,143.1266667,16.01633333,15.59733333,0.927,136.876,30.28233333,114.5833333,12.159,180.0743333,6.742666667,16.39466667,0.450666667,196.946,25.80466667,200.01,25.615,130.6586667,11.95366667,181.3586667,-0.099333333,15.848,0.555333333,165.0243333,7.187666667,170.379,4.431,118.1586667,-4.422,0.162083346,-0.064801123,-0.152702091,0.494349537,0.3148,0.060922543,0.352666667,-0.096204239,0.667466667,-0.035281696,0.378533333,-0.062695183,0.387733333,-0.122577264,0.766266667,-0.185272447,0.693333333,-0.00177264,0.7404,-0.218781503,1.433733333,-0.220554143,0.002604758,0.000425707,0.20811,0.023433333,0.0104055,0.001171667,0.02016,0.001363333,0.002501709,0.000204143,0.197653333,0.055963333,0.009882667,0.002798167,0.01479,0.006176667,0.003088595,0.001094773,0.218676667,0.072883333,0.010933833,0.003644167,0.018243333,0.005773333,0.004072706,-0.001097097,0.19069,0.065163333,0.0095345,0.003258167,0.02229,-0.003816667,0.005056816,0.000550084,0.53069,0.077063333,0.003853167,0.031003333,0.005,-0.001234848,0.472646667,0.087866667,0.023632333,0.004393333,0.03721,-0.005793333,98.13,0.62,1643.25,-265.125,,,,,,,,,,,,,,,80,1.84,156.85,3776,89,1.48,156.85,3037,49,35,19,43,30,30
20,1,78,1.62052,46.75736961,1.133786848,17.8,0.4,19.2,3,46.6,8.4,122,19,62,1,68,-11,26.33333333,0.333333333,27,1,21,2,16,0,37.96666667,-7.066666667,39.1,-5.2,143.167563,16.530591,3.061925086,0.272681254,4.825,-0.355,4.78,-0.37,47.38,0.47847,53.4,-10.70178,63,2,56,2,14,-3,12,-1,68,5,47,0,81,0,73,-16,69,-13,76,-7,556.21,-23.07,133.1543333,-0.828333333,4.376666667,1.9,148.9283333,-3.135666667,134.397,1.522,116.169,31.381,2.248666667,7.511,192.9363333,-10.82766667,197.003,-12.187,194.2496667,-46.29133333,145.836,-5.842,8.59,-3.848666667,173.291,26.35633333,177.782,25.352,142.5543333,27.55133333,0.101822881,0.198131678,-0.598043961,0.520345066,0.324300578,-0.070967245,0.271028902,0.016704432,0.59532948,-0.054262813,0.350104046,0.02456262,0.234450867,0.022482466,0.584554913,0.047045087,0.674404624,-0.046404624,0.505479769,0.039186898,1.179884393,-0.007217726,0.003515112,0.000322345,0.35086,-0.01445,0.017543,-0.0007225,0.021843333,0.003073333,0.00280331,0.000552777,0.271053333,0.0165,0.013552667,0.000825,0.018123333,0.008373333,0.00335092,0.000332953,0.23258,-0.033356667,0.011629,-0.001667833,0.02596,-0.004986667,0.003321353,-0.000608019,0.244386667,-0.02323,0.012219333,-0.0011615,0.02382,-0.00685,0.007531606,-0.000664522,0.75589,-0.115426667,-0.005771333,0.03966,0.005276667,-0.001022051,0.689716667,-0.106063333,0.034485833,-0.005303167,0.036256667,-0.002126667,98.13,0.62,1574.0625,-322.1875,7.6176,-6.3313,5.53,3.74,4.18,4.27,0,,0,,0,,15.54,3.16,99,2.52,133.1543333,6091,80,1.46,133.1543333,3529,36,23,26,29,15,31
22,1,67,1.6129,63.53741497,-2.403628118,24.4,-0.9,36.4,-5.1,117.5,-30.9,129,-11,68,-6,73,-7,27.33333333,-4.666666667,32,-8,17,2,12,1,31.3,2.766666667,31.8,3.1,120.862665,9.868551,1.902228239,0.236216355,4.69,-0.05,4.58,0.05,50.98,4.52097,58,-0.17289,64,12,60,11,13,3,16,0,46,0,52,-10,50,10,57,9,52,5,52,4,630.91,3.84,139.371,-2.345333333,13.065,-1.248333333,152.3613333,-7.275,133.714,-6.84,146.042,5.511666667,14.65366667,-1.692333333,222.717,-18.47466667,206.143,2.981,163.7826667,2.504333333,146.042,16.04433333,14.65366667,-2.094,199.082,12.26966667,206.143,9.759,163.7826667,-8.333,0.106121221,0.140929545,-0.724087832,-0.613205944,0.476439306,-0.142705973,0.304138728,-0.019605395,0.780578035,-0.162311368,0.396624277,-0.115290944,0.306635838,-0.015302505,0.703260116,-0.130593449,0.873063584,-0.257996917,0.610774566,-0.0349079,1.48383815,-0.292904817,0.003884774,-0.0005579,0.30541,-0.022353333,0.0152705,-0.001117667,0.025413333,-0.002303333,0.003419372,0.001093362,0.248743333,-0.011146667,0.012437167,-0.000557333,0.023523333,0.000703333,0.005278692,-0.000717682,0.389596667,0.057116667,0.019479833,0.002855833,0.03471,-0.007676667,0.004458684,-0.000211323,0.22224,0.07105,0.011112,0.0035525,0.024913333,-0.001266667,0.005109893,0.000217265,0.787506667,-0.032726667,-0.001636333,0.03078,0.001793333,-0.000941145,0.47092,-0.030043333,0.023546,-0.001502167,0.030496667,-0.00028,90.94,1.06,4296.75,-221.5625,1.356,-0.8071,8.19,-2.88,19.01,-6.81,0,,2.3,,0,,18.64,-5.44,98,1.58,139.371,3649,80,2.02,139.371,4665,36,19,34,30,18,34
28,2,72,1.77292,92.65306122,-0.952380952,29.5,-0.3,28.5,-3.2,121.8,-10.4,104,15,59,17,60,-1,37.33333333,-2.333333333,38,-1,15,1,14,2,46.43333333,-10.43333333,49.9,-8.6,204.653988,41.650686,2.208820575,0.477142858,6.035,-1.22,5.95,-1.19,51.73,3.05,44.21,12.89,70,6,56,6,14,-1,14,1,40,12,63,8,56,4,49,13,56,4,54,12,594.66,17.78,133.92,-7.072,14.70033333,-0.697333333,139.3146667,-15.25866667,124.7903333,-7.957,136.7376667,17.62533333,10.65666667,3.962,225.4806667,-8.051,201.372,28.249,161.084,11.568,136.7376667,3.791,10.65666667,0.002666667,182.8676667,1.617666667,201.372,-12.693,161.084,-3.692,0.188987378,0.037470182,-0.256955464,0.489724443,0.41100578,0.008327553,0.368416185,-0.031082852,0.779421965,-0.022755299,0.46534104,0.00985896,0.38233526,0.062998073,0.847676301,0.072857033,0.876346821,0.018186513,0.750751445,0.031915222,1.627098266,0.050101734,0.004339441,-0.001088489,0.5916,-0.190766667,0.02958,-0.009538333,0.031086667,-0.007516667,0.005204336,-0.001614117,0.496436667,-0.079346667,0.024821833,-0.003967333,0.033753333,-0.009626667,0.005483125,-0.001268782,0.587563333,-0.071946667,0.029378167,-0.003597333,0.03362,-0.008396667,0.005368517,-0.001256584,0.372573333,-0.048593333,0.018628667,-0.002429667,0.033216667,-0.009056667,0.010699999,-0.002748357,1.21811,-0.1144,-0.00572,0.0526,-0.01116,-0.005018244,1.8619,-0.32221,0.093095,-0.0161105,0.13023,-0.07236,87.5,7,4081.875,2468.75,4.8809,-4.1874,5.76,-3.02,19.14,-8.51,0,,0,,0,,16.67,-4.45,99,2.49,133.92,5985,80,2.13,133.92,5119,46,29,21,51,19,27
33,2,60,1.6637,92.33560091,-3.990929705,33.4,-1.5,40.7,-1.8,190.9,-14.2,153,-16,89,-7,72,2,37.33333333,6.666666667,42,6,11,4,10,2,41.3,-3.6,42.7,-4,239.296596,-0.148764,2.591596239,0.115390258,6.005,-0.575,5.83,-0.45,56.17,-7.24,49.37,-0.36,64,-1,52,-1,10,-1,14,-1,35,4,47,7,34,0,41,4,43,5,34,6,585.43,-70.36,120.7086667,15.09933333,14.23433333,-1.680333333,109.7966667,16.39666667,110.1493333,1.27,161.6113333,16.86766667,12.285,-0.166666667,186.8853333,20.49233333,191.838,29.912,141.389,-2.408,162.3583333,2.000666667,11.072,1.831666667,190.1943333,-4.596666667,199.592,-9.809,143.3176667,-7.341333333,-0.017706044,-0.122731819,-1.187436605,-0.034021423,0.539514451,0.114752216,0.443699422,-0.040766089,0.983213873,0.073986127,0.518242775,0.102290559,0.403283237,0.02738343,0.921526012,0.129673988,1.057757225,0.217042775,0.846982659,-0.013382659,1.904739884,0.203660116,0.003169228,-2.44E-05,0.23624,0.007576667,0.011812,0.000378833,0.019453333,-0.00076,0.003020988,-0.000119673,0.288003333,-0.052926667,0.014400167,-0.002646333,0.021956667,-0.004173333,0.003577117,-9.18E-05,0.258753333,-0.020443333,0.012937667,-0.001022167,0.02589,-0.003126667,0.004059704,-0.000598711,0.232816667,-0.01045,0.011640833,-0.0005225,0.023316667,7.67E-05,0.00517418,-0.000256029,0.54129,0.07415,0.0037075,0.035313333,0.000313333,-0.000216638,0.538643333,0.005053333,0.026932167,0.000252667,0.028466667,0.003826667,93.13,-5.63,5056.5,-1525.25,3.3011,-2.9563,10.34,-3.25,18.87,4.32,274.58,10.83,0,,23.49,-1.29,12.33,-0.22,97,1.77,120.7086667,4720,79,1.53,120.7086667,4080,51,17,46,49,27,38
29,2,68,1.76276,73.78684807,-1.814058957,23.7,-0.5,20,-1.3,68.9,-5.6,123,-12,65,-8,73,-4,51.66666667,2.663333333,54,2,17,1,16,0,39.47,-5.17,41.5,-3,217.287609,7.501263,2.944801339,0.178446694,4.495,-0.785,4.44,-0.75,56.61,0,53.72,0,64,2,52,2,10,-3,10,-1,45,-3,57,-3,53,1,40,8,49,0,48,1,604.75,-19.11,147.0413333,0.249333333,8.955,-1.974666667,119.119,-0.129,97.50666667,-0.317333333,178.937,-13.04366667,10.33466667,-2.003666667,201.6873333,39.24566667,215.578,35.131,134.9263333,39.301,181.775,-2.408666667,9.54,-0.531333333,208.225,21.787,213.892,28.39,137.0383333,16.86366667,-0.03241486,-0.077742814,-2.425666637,-1.022283853,0.491514451,-0.134447784,0.413086705,-0.039620039,0.904601156,-0.174067823,0.42649711,-0.002230443,0.359445087,0.022154913,0.785942197,0.01992447,0.918011561,-0.136678227,0.772531792,-0.017465125,1.690543353,-0.154143353,0.003620805,-0.000434511,0.21045,-0.011353333,0.0105225,-0.000567667,0.020246667,-0.00091,0.002831483,-0.000356257,0.238196667,0.005283333,0.011909833,0.000264167,0.01688,-0.001296667,0.003949212,0.000981026,0.17018,0.051306667,0.008509,0.002565333,0.021346667,0.00721,0.003852568,0.000423222,0.217436667,0.018343333,0.010871833,0.000917167,0.020293333,0.000773333,0.004652823,-0.000434511,0.62635,-0.17241,-0.0086205,0.030263333,-0.004666667,-8.02E-05,0.4543,-0.106193333,0.022715,-0.005309667,0.02019,-0.00117,98.13,-0.005,50,990.625,0.02182,0.32538,27.03,-5.71,21.98,10.15,0,,3.98,2.83,0,,19.33,5.77,76,1.86,147.2907,4065,72,1.6,147.2907,3496,22,14,32,32,12,31
30,1,66,1.66116,75.32879819,-1.541950113,27.3,-0.6,39.5,0,154.2,0,126,8,85,1,85,-5,26.66666667,2.333333333,28,3,14,1,16,0,34.53,-1.83,37.2,-3.9,195.278622,0.295911,2.59235016,0.058183616,5.1535,-0.5285,4.94,-0.35,50.16,5.76,58.84,-0.09,52,12,48,12,8,1,9,3,42,0,56,3,48,5,67,-5,55,-5,55,0,579.6,56.36,145.4513333,11.60133333,13.30233333,0.303666667,140.6943333,15.39733333,118.2693333,0.622333333,163.8803333,-5.022,12.368,-3.981333333,202.09,-1.136666667,214.052,-2.967,147.909,4.586666667,155.596,-2.108333333,11.461,1.976,177.4153333,1.014666667,185.927,0.521,137.8743333,3.672333333,0.122097415,0.010015008,-1.377696456,-0.017973754,0.48383815,-0.067171484,0.451514451,-0.054581118,0.935352601,-0.121752601,0.551630058,-0.156030058,0.383537572,0.014329094,0.93516763,-0.141700963,1.035468208,-0.223201541,0.835052023,-0.040252023,1.870520231,-0.263453565,0.003778335,0.000402175,0.292983333,0.061816667,0.014649167,0.003090833,0.023783333,0.001636667,0.002000914,9.24E-05,0.21204,0.005933333,0.010602,0.000296667,0.01428,0.000346667,0.003071516,0.001158765,0.238283333,0.030296667,0.011914167,0.001514833,0.01993,0.005063333,0.003560668,0.000382564,0.166376667,0.04359,0.008318833,0.0021795,0.020663333,0.00231,0.004728274,1.98E-05,0.486913333,0.041206667,0.002060333,0.033253333,-0.000298333,-0.000561832,0.456983333,-0.156213333,0.022849167,-0.007810667,0.034513333,-0.008768333,100,-0.625,165,1211.625,2.6348,-2.0338,88.62,6.33,19.69,1.08,151.74,-65.26,8.7,-0.39,9.25,-3.15,43.35,-11.36,76,1.96,157.0527,4017,68,1.79,157.0527,3668,34,16,39,43,20,44
31,2,65,1.778,106.4399093,-3.673469388,32.8,-1.1,33.9,-0.5,181,-12.3,159,-11,87,-8,75,0,36,8.33,37,13,,,16,0,41.73,-9.6,43.6,-11,227.256414,13.322463,2.135067716,0.205957985,6.485,0.185,6.44,-0.06,47.45,6.77,58.62,0.22,47,16,38,13,4,3,6,3,40,3,54,0,44,0,49,-7,53,-18,47,-7,594.79,-19.36,142.7833333,-5.137333333,12.69133333,-1.725666667,131.9273333,-2.481,110.557,2.046666667,150.8653333,11.61966667,14.52966667,-1.529666667,163.0853333,30.71933333,168.732,38.368,132.0856667,11.21066667,151.5666667,-0.68,12.51,-1.595666667,157.7596667,4.619,159.073,8.518,127.2023333,1.955,0.032655706,-0.129497252,-0.766278374,0.685030342,0.604531792,-0.151198459,0.455861272,0.038272062,1.060393064,-0.112926397,0.627884393,-0.122284393,0.536369942,-0.056769942,1.164254335,-0.179054335,1.232416185,-0.273482852,0.992231214,-0.018497881,2.224647399,-0.291980732,0.004017148,-0.000538599,0.2701,-0.034013333,0.013505,-0.001700667,0.02512,-0.000536667,0.003835485,-0.000202724,0.360223333,-0.06583,0.018011167,-0.0032915,0.026186667,-0.001293333,0.005401654,-0.000135024,0.34846,0.007173333,0.017423,0.000358667,0.032436667,0.001423333,0.004097425,5.01E-05,0.299,-0.07063,0.01495,-0.0035315,0.02443,0.001533333,0.005568961,0.002168629,0.616536667,0.016373333,0.000818667,0.034956667,0.011266667,-0.001398015,0.486056667,0.028143333,0.024302833,0.001407167,0.037233333,0.001963333,93.13,4.995,442.9375,1386.3125,3.5672,1.562,8.41,-4.02,40.11,-14.53,54.48,-44.23,4.34,,0,,21.5,-8.24,76,1.96,137.646,4583,72,1.83,137.646,4279,39,9,27,34,15,29
